[NU-1962] Flink scenario testing mechanism: mini cluster created once and reused each time #16217
GitHub Actions / REPORT-BackendTests-2.13
failed
Jan 21, 2025 in 0s
2491 passed, 6 failed and 8 skipped
Annotations
github-actions / REPORT-BackendTests-2.13
pl.touk.nussknacker.ui.integration.BaseFlowTest ► should test process with complexReturnObjectService
Failed test found in:
designer/server/target/test-reports/TEST-pl.touk.nussknacker.ui.integration.BaseFlowTest.xml
Error:
sttp.client3.SttpClientException$TimeoutException: Exception when sending request: POST http://localhost:20002/api/processManagement/test/complexObjectProcessd32aeeec-fbb4-480a-b64f-ec9c0461095b
Raw output
sttp.client3.SttpClientException$TimeoutException: Exception when sending request: POST http://localhost:20002/api/processManagement/test/complexObjectProcessd32aeeec-fbb4-480a-b64f-ec9c0461095b
at sttp.client3.SttpClientExceptionExtensions.defaultExceptionToSttpClientException(SttpClientExceptionExtensions.scala:21)
at sttp.client3.SttpClientExceptionExtensions.defaultExceptionToSttpClientException$(SttpClientExceptionExtensions.scala:11)
at sttp.client3.SttpClientException$.defaultExceptionToSttpClientException(SttpClientException.scala:24)
at sttp.client3.HttpClientSyncBackend.$anonfun$adjustExceptions$1(HttpClientSyncBackend.scala:42)
at sttp.client3.SttpClientException$$anonfun$adjustExceptions$1.applyOrElse(SttpClientException.scala:35)
at sttp.client3.SttpClientException$$anonfun$adjustExceptions$1.applyOrElse(SttpClientException.scala:34)
at scala.runtime.AbstractPartialFunction.apply(AbstractPartialFunction.scala:35)
at sttp.monad.MonadError.handleError(MonadError.scala:28)
at sttp.monad.MonadError.handleError$(MonadError.scala:25)
at sttp.client3.monad.IdMonad$.handleError(IdMonad.scala:6)
at sttp.client3.SttpClientException$.adjustExceptions(SttpClientException.scala:34)
at sttp.client3.HttpClientSyncBackend.adjustExceptions(HttpClientSyncBackend.scala:42)
at sttp.client3.HttpClientSyncBackend.send(HttpClientSyncBackend.scala:32)
at sttp.client3.HttpClientSyncBackend.send(HttpClientSyncBackend.scala:18)
at sttp.client3.FollowRedirectsBackend.sendWithCounter(FollowRedirectsBackend.scala:29)
at sttp.client3.FollowRedirectsBackend.send(FollowRedirectsBackend.scala:24)
at sttp.client3.RequestT.send(RequestT.scala:365)
at sttp.client3.logging.LoggingWithResponseBodyBackend.$anonfun$send$8(LoggingBackend.scala:95)
at sttp.monad.syntax$MonadErrorOps.flatMap(MonadError.scala:63)
at sttp.client3.logging.LoggingWithResponseBodyBackend.$anonfun$send$7(LoggingBackend.scala:95)
at scala.util.Try$.apply(Try.scala:217)
at sttp.monad.MonadError.handleError(MonadError.scala:26)
at sttp.monad.MonadError.handleError$(MonadError.scala:25)
at sttp.client3.monad.IdMonad$.handleError(IdMonad.scala:6)
at sttp.monad.syntax$MonadErrorOps.handleError(MonadError.scala:64)
at sttp.client3.logging.LoggingWithResponseBodyBackend.$anonfun$send$2(LoggingBackend.scala:98)
at sttp.client3.monad.IdMonad$.flatMap(IdMonad.scala:9)
at sttp.monad.syntax$MonadErrorOps.flatMap(MonadError.scala:63)
at sttp.client3.logging.LoggingWithResponseBodyBackend.send(LoggingBackend.scala:85)
at pl.touk.nussknacker.ui.integration.BaseFlowTest.$anonfun$new$8(BaseFlowTest.scala:393)
at org.scalatest.OutcomeOf.outcomeOf(OutcomeOf.scala:85)
at org.scalatest.OutcomeOf.outcomeOf$(OutcomeOf.scala:83)
at org.scalatest.OutcomeOf$.outcomeOf(OutcomeOf.scala:104)
at org.scalatest.Transformer.apply(Transformer.scala:22)
at org.scalatest.Transformer.apply(Transformer.scala:20)
at org.scalatest.funsuite.AnyFunSuiteLike$$anon$1.apply(AnyFunSuiteLike.scala:226)
at org.scalatest.TestSuite.withFixture(TestSuite.scala:196)
at org.scalatest.TestSuite.withFixture$(TestSuite.scala:195)
at pl.touk.nussknacker.ui.integration.BaseFlowTest.withFixture(BaseFlowTest.scala:59)
at org.scalatest.funsuite.AnyFunSuiteLike.invokeWithFixture$1(AnyFunSuiteLike.scala:224)
at org.scalatest.funsuite.AnyFunSuiteLike.$anonfun$runTest$1(AnyFunSuiteLike.scala:236)
at org.scalatest.SuperEngine.runTestImpl(Engine.scala:306)
at org.scalatest.funsuite.AnyFunSuiteLike.runTest(AnyFunSuiteLike.scala:236)
at org.scalatest.funsuite.AnyFunSuiteLike.runTest$(AnyFunSuiteLike.scala:218)
at pl.touk.nussknacker.ui.integration.BaseFlowTest.org$scalatest$BeforeAndAfterEach$$super$runTest(BaseFlowTest.scala:59)
at org.scalatest.BeforeAndAfterEach.runTest(BeforeAndAfterEach.scala:234)
at org.scalatest.BeforeAndAfterEach.runTest$(BeforeAndAfterEach.scala:227)
at pl.touk.nussknacker.ui.integration.BaseFlowTest.runTest(BaseFlowTest.scala:59)
at org.scalatest.funsuite.AnyFunSuiteLike.$anonfun$runTests$1(AnyFunSuiteLike.scala:269)
at org.scalatest.SuperEngine.$anonfun$runTestsInBranch$1(Engine.scala:413)
at scala.collection.immutable.List.foreach(List.scala:334)
at org.scalatest.SuperEngine.traverseSubNodes$1(Engine.scala:401)
at org.scalatest.SuperEngine.runTestsInBranch(Engine.scala:396)
at org.scalatest.SuperEngine.runTestsImpl(Engine.scala:475)
at org.scalatest.funsuite.AnyFunSuiteLike.runTests(AnyFunSuiteLike.scala:269)
at org.scalatest.funsuite.AnyFunSuiteLike.runTests$(AnyFunSuiteLike.scala:268)
at pl.touk.nussknacker.ui.integration.BaseFlowTest.runTests(BaseFlowTest.scala:59)
at org.scalatest.Suite.run(Suite.scala:1114)
at org.scalatest.Suite.run$(Suite.scala:1096)
at pl.touk.nussknacker.ui.integration.BaseFlowTest.org$scalatest$funsuite$AnyFunSuiteLike$$super$run(BaseFlowTest.scala:59)
at org.scalatest.funsuite.AnyFunSuiteLike.$anonfun$run$1(AnyFunSuiteLike.scala:273)
at org.scalatest.SuperEngine.runImpl(Engine.scala:535)
at org.scalatest.funsuite.AnyFunSuiteLike.run(AnyFunSuiteLike.scala:273)
at org.scalatest.funsuite.AnyFunSuiteLike.run$(AnyFunSuiteLike.scala:272)
at pl.touk.nussknacker.ui.integration.BaseFlowTest.org$scalatest$BeforeAndAfterAll$$super$run(BaseFlowTest.scala:59)
at org.scalatest.BeforeAndAfterAll.liftedTree1$1(BeforeAndAfterAll.scala:213)
at org.scalatest.BeforeAndAfterAll.run(BeforeAndAfterAll.scala:210)
at org.scalatest.BeforeAndAfterAll.run$(BeforeAndAfterAll.scala:208)
at pl.touk.nussknacker.ui.integration.BaseFlowTest.run(BaseFlowTest.scala:59)
at org.scalatest.tools.Framework.org$scalatest$tools$Framework$$runSuite(Framework.scala:321)
at org.scalatest.tools.Framework$ScalaTestTask.execute(Framework.scala:517)
at sbt.TestRunner.runTest$1(TestFramework.scala:153)
at sbt.TestRunner.run(TestFramework.scala:168)
at sbt.TestFramework$$anon$3$$anonfun$$lessinit$greater$1.$anonfun$apply$1(TestFramework.scala:336)
at sbt.TestFramework$.sbt$TestFramework$$withContextLoader(TestFramework.scala:296)
at sbt.TestFramework$$anon$3$$anonfun$$lessinit$greater$1.apply(TestFramework.scala:336)
at sbt.TestFramework$$anon$3$$anonfun$$lessinit$greater$1.apply(TestFramework.scala:336)
at sbt.TestFunction.apply(TestFramework.scala:348)
at sbt.Tests$.processRunnable$1(Tests.scala:475)
at sbt.Tests$.$anonfun$makeSerial$1(Tests.scala:481)
at sbt.std.Transform$$anon$3.$anonfun$apply$2(Transform.scala:47)
at sbt.std.Transform$$anon$4.work(Transform.scala:69)
at sbt.Execute.$anonfun$submit$2(Execute.scala:283)
at sbt.internal.util.ErrorHandling$.wideConvert(ErrorHandling.scala:24)
at sbt.Execute.work(Execute.scala:292)
at sbt.Execute.$anonfun$submit$1(Execute.scala:283)
at sbt.ConcurrentRestrictions$$anon$4.$anonfun$submitValid$1(ConcurrentRestrictions.scala:265)
at sbt.CompletionService$$anon$2.call(CompletionService.scala:65)
at java.base/java.util.concurrent.FutureTask.run(FutureTask.java:264)
at java.base/java.util.concurrent.Executors$RunnableAdapter.call(Executors.java:515)
at java.base/java.util.concurrent.FutureTask.run(FutureTask.java:264)
at java.base/java.util.concurrent.ThreadPoolExecutor.runWorker(ThreadPoolExecutor.java:1128)
at java.base/java.util.concurrent.ThreadPoolExecutor$Worker.run(ThreadPoolExecutor.java:628)
at java.base/java.lang.Thread.run(Thread.java:829)
Caused by: java.net.http.HttpTimeoutException: request timed out
at java.net.http/jdk.internal.net.http.HttpClientImpl.send(HttpClientImpl.java:559)
at java.net.http/jdk.internal.net.http.HttpClientFacade.send(HttpClientFacade.java:119)
at sttp.client3.HttpClientSyncBackend.$anonfun$send$1(HttpClientSyncBackend.scala:34)
at scala.util.Try$.apply(Try.scala:217)
at sttp.monad.MonadError.handleError(MonadError.scala:26)
... 86 more
github-actions / REPORT-BackendTests-2.13
pl.touk.nussknacker.ui.integration.BaseFlowTest ► should reload ConfigCreator
Failed test found in:
designer/server/target/test-reports/TEST-pl.touk.nussknacker.ui.integration.BaseFlowTest.xml
Error:
sttp.client3.SttpClientException$TimeoutException: Exception when sending request: POST http://localhost:20002/api/processManagement/test/test
Raw output
sttp.client3.SttpClientException$TimeoutException: Exception when sending request: POST http://localhost:20002/api/processManagement/test/test
at sttp.client3.SttpClientExceptionExtensions.defaultExceptionToSttpClientException(SttpClientExceptionExtensions.scala:21)
at sttp.client3.SttpClientExceptionExtensions.defaultExceptionToSttpClientException$(SttpClientExceptionExtensions.scala:11)
at sttp.client3.SttpClientException$.defaultExceptionToSttpClientException(SttpClientException.scala:24)
at sttp.client3.HttpClientSyncBackend.$anonfun$adjustExceptions$1(HttpClientSyncBackend.scala:42)
at sttp.client3.SttpClientException$$anonfun$adjustExceptions$1.applyOrElse(SttpClientException.scala:35)
at sttp.client3.SttpClientException$$anonfun$adjustExceptions$1.applyOrElse(SttpClientException.scala:34)
at scala.runtime.AbstractPartialFunction.apply(AbstractPartialFunction.scala:35)
at sttp.monad.MonadError.handleError(MonadError.scala:28)
at sttp.monad.MonadError.handleError$(MonadError.scala:25)
at sttp.client3.monad.IdMonad$.handleError(IdMonad.scala:6)
at sttp.client3.SttpClientException$.adjustExceptions(SttpClientException.scala:34)
at sttp.client3.HttpClientSyncBackend.adjustExceptions(HttpClientSyncBackend.scala:42)
at sttp.client3.HttpClientSyncBackend.send(HttpClientSyncBackend.scala:32)
at sttp.client3.HttpClientSyncBackend.send(HttpClientSyncBackend.scala:18)
at sttp.client3.FollowRedirectsBackend.sendWithCounter(FollowRedirectsBackend.scala:29)
at sttp.client3.FollowRedirectsBackend.send(FollowRedirectsBackend.scala:24)
at sttp.client3.RequestT.send(RequestT.scala:365)
at sttp.client3.logging.LoggingWithResponseBodyBackend.$anonfun$send$8(LoggingBackend.scala:95)
at sttp.monad.syntax$MonadErrorOps.flatMap(MonadError.scala:63)
at sttp.client3.logging.LoggingWithResponseBodyBackend.$anonfun$send$7(LoggingBackend.scala:95)
at scala.util.Try$.apply(Try.scala:217)
at sttp.monad.MonadError.handleError(MonadError.scala:26)
at sttp.monad.MonadError.handleError$(MonadError.scala:25)
at sttp.client3.monad.IdMonad$.handleError(IdMonad.scala:6)
at sttp.monad.syntax$MonadErrorOps.handleError(MonadError.scala:64)
at sttp.client3.logging.LoggingWithResponseBodyBackend.$anonfun$send$2(LoggingBackend.scala:98)
at sttp.client3.monad.IdMonad$.flatMap(IdMonad.scala:9)
at sttp.monad.syntax$MonadErrorOps.flatMap(MonadError.scala:63)
at sttp.client3.logging.LoggingWithResponseBodyBackend.send(LoggingBackend.scala:85)
at pl.touk.nussknacker.ui.integration.BaseFlowTest.testProcess(BaseFlowTest.scala:576)
at pl.touk.nussknacker.ui.integration.BaseFlowTest.$anonfun$new$9(BaseFlowTest.scala:464)
at org.scalatest.OutcomeOf.outcomeOf(OutcomeOf.scala:85)
at org.scalatest.OutcomeOf.outcomeOf$(OutcomeOf.scala:83)
at org.scalatest.OutcomeOf$.outcomeOf(OutcomeOf.scala:104)
at org.scalatest.Transformer.apply(Transformer.scala:22)
at org.scalatest.Transformer.apply(Transformer.scala:20)
at org.scalatest.funsuite.AnyFunSuiteLike$$anon$1.apply(AnyFunSuiteLike.scala:226)
at org.scalatest.TestSuite.withFixture(TestSuite.scala:196)
at org.scalatest.TestSuite.withFixture$(TestSuite.scala:195)
at pl.touk.nussknacker.ui.integration.BaseFlowTest.withFixture(BaseFlowTest.scala:59)
at org.scalatest.funsuite.AnyFunSuiteLike.invokeWithFixture$1(AnyFunSuiteLike.scala:224)
at org.scalatest.funsuite.AnyFunSuiteLike.$anonfun$runTest$1(AnyFunSuiteLike.scala:236)
at org.scalatest.SuperEngine.runTestImpl(Engine.scala:306)
at org.scalatest.funsuite.AnyFunSuiteLike.runTest(AnyFunSuiteLike.scala:236)
at org.scalatest.funsuite.AnyFunSuiteLike.runTest$(AnyFunSuiteLike.scala:218)
at pl.touk.nussknacker.ui.integration.BaseFlowTest.org$scalatest$BeforeAndAfterEach$$super$runTest(BaseFlowTest.scala:59)
at org.scalatest.BeforeAndAfterEach.runTest(BeforeAndAfterEach.scala:234)
at org.scalatest.BeforeAndAfterEach.runTest$(BeforeAndAfterEach.scala:227)
at pl.touk.nussknacker.ui.integration.BaseFlowTest.runTest(BaseFlowTest.scala:59)
at org.scalatest.funsuite.AnyFunSuiteLike.$anonfun$runTests$1(AnyFunSuiteLike.scala:269)
at org.scalatest.SuperEngine.$anonfun$runTestsInBranch$1(Engine.scala:413)
at scala.collection.immutable.List.foreach(List.scala:334)
at org.scalatest.SuperEngine.traverseSubNodes$1(Engine.scala:401)
at org.scalatest.SuperEngine.runTestsInBranch(Engine.scala:396)
at org.scalatest.SuperEngine.runTestsImpl(Engine.scala:475)
at org.scalatest.funsuite.AnyFunSuiteLike.runTests(AnyFunSuiteLike.scala:269)
at org.scalatest.funsuite.AnyFunSuiteLike.runTests$(AnyFunSuiteLike.scala:268)
at pl.touk.nussknacker.ui.integration.BaseFlowTest.runTests(BaseFlowTest.scala:59)
at org.scalatest.Suite.run(Suite.scala:1114)
at org.scalatest.Suite.run$(Suite.scala:1096)
at pl.touk.nussknacker.ui.integration.BaseFlowTest.org$scalatest$funsuite$AnyFunSuiteLike$$super$run(BaseFlowTest.scala:59)
at org.scalatest.funsuite.AnyFunSuiteLike.$anonfun$run$1(AnyFunSuiteLike.scala:273)
at org.scalatest.SuperEngine.runImpl(Engine.scala:535)
at org.scalatest.funsuite.AnyFunSuiteLike.run(AnyFunSuiteLike.scala:273)
at org.scalatest.funsuite.AnyFunSuiteLike.run$(AnyFunSuiteLike.scala:272)
at pl.touk.nussknacker.ui.integration.BaseFlowTest.org$scalatest$BeforeAndAfterAll$$super$run(BaseFlowTest.scala:59)
at org.scalatest.BeforeAndAfterAll.liftedTree1$1(BeforeAndAfterAll.scala:213)
at org.scalatest.BeforeAndAfterAll.run(BeforeAndAfterAll.scala:210)
at org.scalatest.BeforeAndAfterAll.run$(BeforeAndAfterAll.scala:208)
at pl.touk.nussknacker.ui.integration.BaseFlowTest.run(BaseFlowTest.scala:59)
at org.scalatest.tools.Framework.org$scalatest$tools$Framework$$runSuite(Framework.scala:321)
at org.scalatest.tools.Framework$ScalaTestTask.execute(Framework.scala:517)
at sbt.TestRunner.runTest$1(TestFramework.scala:153)
at sbt.TestRunner.run(TestFramework.scala:168)
at sbt.TestFramework$$anon$3$$anonfun$$lessinit$greater$1.$anonfun$apply$1(TestFramework.scala:336)
at sbt.TestFramework$.sbt$TestFramework$$withContextLoader(TestFramework.scala:296)
at sbt.TestFramework$$anon$3$$anonfun$$lessinit$greater$1.apply(TestFramework.scala:336)
at sbt.TestFramework$$anon$3$$anonfun$$lessinit$greater$1.apply(TestFramework.scala:336)
at sbt.TestFunction.apply(TestFramework.scala:348)
at sbt.Tests$.processRunnable$1(Tests.scala:475)
at sbt.Tests$.$anonfun$makeSerial$1(Tests.scala:481)
at sbt.std.Transform$$anon$3.$anonfun$apply$2(Transform.scala:47)
at sbt.std.Transform$$anon$4.work(Transform.scala:69)
at sbt.Execute.$anonfun$submit$2(Execute.scala:283)
at sbt.internal.util.ErrorHandling$.wideConvert(ErrorHandling.scala:24)
at sbt.Execute.work(Execute.scala:292)
at sbt.Execute.$anonfun$submit$1(Execute.scala:283)
at sbt.ConcurrentRestrictions$$anon$4.$anonfun$submitValid$1(ConcurrentRestrictions.scala:265)
at sbt.CompletionService$$anon$2.call(CompletionService.scala:65)
at java.base/java.util.concurrent.FutureTask.run(FutureTask.java:264)
at java.base/java.util.concurrent.Executors$RunnableAdapter.call(Executors.java:515)
at java.base/java.util.concurrent.FutureTask.run(FutureTask.java:264)
at java.base/java.util.concurrent.ThreadPoolExecutor.runWorker(ThreadPoolExecutor.java:1128)
at java.base/java.util.concurrent.ThreadPoolExecutor$Worker.run(ThreadPoolExecutor.java:628)
at java.base/java.lang.Thread.run(Thread.java:829)
Caused by: java.net.http.HttpTimeoutException: request timed out
at java.net.http/jdk.internal.net.http.HttpClientImpl.send(HttpClientImpl.java:559)
at java.net.http/jdk.internal.net.http.HttpClientFacade.send(HttpClientFacade.java:119)
at sttp.client3.HttpClientSyncBackend.$anonfun$send$1(HttpClientSyncBackend.scala:34)
at scala.util.Try$.apply(Try.scala:217)
at sttp.monad.MonadError.handleError(MonadError.scala:26)
... 87 more
github-actions / REPORT-BackendTests-2.13
pl.touk.nussknacker.engine.management.testsmechanism.FlinkProcessTestRunnerSpec ► A scenario run on Flink engine when IO monad interpreter is used should handle transient errors
Failed test found in:
engine/flink/management/target/test-reports/TEST-pl.touk.nussknacker.engine.management.testsmechanism.FlinkProcessTestRunnerSpec.xml
engine/flink/management/target/test-reports/TEST-pl.touk.nussknacker.engine.management.testsmechanism.FlinkProcessTestRunnerSpec.xml
Error:
org.scalatest.exceptions.TestFailedException: Expected exception org.apache.flink.runtime.client.JobExecutionException to be thrown, but java.lang.IllegalArgumentException was thrown
Raw output
org.scalatest.exceptions.TestFailedException: Expected exception org.apache.flink.runtime.client.JobExecutionException to be thrown, but java.lang.IllegalArgumentException was thrown
at org.scalatest.Assertions.newAssertionFailedException(Assertions.scala:472)
at org.scalatest.Assertions.newAssertionFailedException$(Assertions.scala:471)
at org.scalatest.wordspec.AnyWordSpec.newAssertionFailedException(AnyWordSpec.scala:1880)
at org.scalatest.Assertions.intercept(Assertions.scala:756)
at org.scalatest.Assertions.intercept$(Assertions.scala:746)
at org.scalatest.wordspec.AnyWordSpec.intercept(AnyWordSpec.scala:1880)
at pl.touk.nussknacker.engine.management.testsmechanism.FlinkProcessTestRunnerSpec.$anonfun$runTests$9(FlinkProcessTestRunnerSpec.scala:350)
at org.scalatest.OutcomeOf.outcomeOf(OutcomeOf.scala:85)
at org.scalatest.OutcomeOf.outcomeOf$(OutcomeOf.scala:83)
at org.scalatest.OutcomeOf$.outcomeOf(OutcomeOf.scala:104)
at org.scalatest.Transformer.apply(Transformer.scala:22)
at org.scalatest.Transformer.apply(Transformer.scala:20)
at org.scalatest.wordspec.AnyWordSpecLike$$anon$3.apply(AnyWordSpecLike.scala:1240)
at org.scalatest.TestSuite.withFixture(TestSuite.scala:196)
at org.scalatest.TestSuite.withFixture$(TestSuite.scala:195)
at org.scalatest.wordspec.AnyWordSpec.withFixture(AnyWordSpec.scala:1880)
at org.scalatest.wordspec.AnyWordSpecLike.invokeWithFixture$1(AnyWordSpecLike.scala:1238)
at org.scalatest.wordspec.AnyWordSpecLike.$anonfun$runTest$1(AnyWordSpecLike.scala:1250)
at org.scalatest.SuperEngine.runTestImpl(Engine.scala:306)
at org.scalatest.wordspec.AnyWordSpecLike.runTest(AnyWordSpecLike.scala:1250)
at org.scalatest.wordspec.AnyWordSpecLike.runTest$(AnyWordSpecLike.scala:1232)
at pl.touk.nussknacker.engine.management.testsmechanism.FlinkProcessTestRunnerSpec.org$scalatest$BeforeAndAfterEach$$super$runTest(FlinkProcessTestRunnerSpec.scala:52)
at org.scalatest.BeforeAndAfterEach.runTest(BeforeAndAfterEach.scala:234)
at org.scalatest.BeforeAndAfterEach.runTest$(BeforeAndAfterEach.scala:227)
at pl.touk.nussknacker.engine.management.testsmechanism.FlinkProcessTestRunnerSpec.runTest(FlinkProcessTestRunnerSpec.scala:52)
at org.scalatest.wordspec.AnyWordSpecLike.$anonfun$runTests$1(AnyWordSpecLike.scala:1309)
at org.scalatest.SuperEngine.$anonfun$runTestsInBranch$1(Engine.scala:413)
at scala.collection.immutable.List.foreach(List.scala:334)
at org.scalatest.SuperEngine.traverseSubNodes$1(Engine.scala:401)
at org.scalatest.SuperEngine.runTestsInBranch(Engine.scala:390)
at org.scalatest.SuperEngine.$anonfun$runTestsInBranch$1(Engine.scala:427)
at scala.collection.immutable.List.foreach(List.scala:334)
at org.scalatest.SuperEngine.traverseSubNodes$1(Engine.scala:401)
at org.scalatest.SuperEngine.runTestsInBranch(Engine.scala:390)
at org.scalatest.SuperEngine.$anonfun$runTestsInBranch$1(Engine.scala:427)
at scala.collection.immutable.List.foreach(List.scala:334)
at org.scalatest.SuperEngine.traverseSubNodes$1(Engine.scala:401)
at org.scalatest.SuperEngine.runTestsInBranch(Engine.scala:396)
at org.scalatest.SuperEngine.runTestsImpl(Engine.scala:475)
at org.scalatest.wordspec.AnyWordSpecLike.runTests(AnyWordSpecLike.scala:1309)
at org.scalatest.wordspec.AnyWordSpecLike.runTests$(AnyWordSpecLike.scala:1308)
at org.scalatest.wordspec.AnyWordSpec.runTests(AnyWordSpec.scala:1880)
at org.scalatest.Suite.run(Suite.scala:1114)
at org.scalatest.Suite.run$(Suite.scala:1096)
at org.scalatest.wordspec.AnyWordSpec.org$scalatest$wordspec$AnyWordSpecLike$$super$run(AnyWordSpec.scala:1880)
at org.scalatest.wordspec.AnyWordSpecLike.$anonfun$run$1(AnyWordSpecLike.scala:1354)
at org.scalatest.SuperEngine.runImpl(Engine.scala:535)
at org.scalatest.wordspec.AnyWordSpecLike.run(AnyWordSpecLike.scala:1354)
at org.scalatest.wordspec.AnyWordSpecLike.run$(AnyWordSpecLike.scala:1352)
at org.scalatest.wordspec.AnyWordSpec.run(AnyWordSpec.scala:1880)
at org.scalatest.tools.Framework.org$scalatest$tools$Framework$$runSuite(Framework.scala:321)
at org.scalatest.tools.Framework$ScalaTestTask.execute(Framework.scala:517)
at sbt.TestRunner.runTest$1(TestFramework.scala:153)
at sbt.TestRunner.run(TestFramework.scala:168)
at sbt.TestFramework$$anon$3$$anonfun$$lessinit$greater$1.$anonfun$apply$1(TestFramework.scala:336)
at sbt.TestFramework$.sbt$TestFramework$$withContextLoader(TestFramework.scala:296)
at sbt.TestFramework$$anon$3$$anonfun$$lessinit$greater$1.apply(TestFramework.scala:336)
at sbt.TestFramework$$anon$3$$anonfun$$lessinit$greater$1.apply(TestFramework.scala:336)
at sbt.TestFunction.apply(TestFramework.scala:348)
at sbt.Tests$.processRunnable$1(Tests.scala:475)
at sbt.Tests$.$anonfun$makeSerial$1(Tests.scala:481)
at sbt.std.Transform$$anon$3.$anonfun$apply$2(Transform.scala:47)
at sbt.std.Transform$$anon$4.work(Transform.scala:69)
at sbt.Execute.$anonfun$submit$2(Execute.scala:283)
at sbt.internal.util.ErrorHandling$.wideConvert(ErrorHandling.scala:24)
at sbt.Execute.work(Execute.scala:292)
at sbt.Execute.$anonfun$submit$1(Execute.scala:283)
at sbt.ConcurrentRestrictions$$anon$4.$anonfun$submitValid$1(ConcurrentRestrictions.scala:265)
at sbt.CompletionService$$anon$2.call(CompletionService.scala:65)
at java.base/java.util.concurrent.FutureTask.run(FutureTask.java:264)
at java.base/java.util.concurrent.Executors$RunnableAdapter.call(Executors.java:515)
at java.base/java.util.concurrent.FutureTask.run(FutureTask.java:264)
at java.base/java.util.concurrent.ThreadPoolExecutor.runWorker(ThreadPoolExecutor.java:1128)
at java.base/java.util.concurrent.ThreadPoolExecutor$Worker.run(ThreadPoolExecutor.java:628)
at java.base/java.lang.Thread.run(Thread.java:829)
Caused by: java.lang.IllegalArgumentException: Failed to find pl.touk.nussknacker.engine.flink.api.exception.FlinkEspExceptionConsumerProvider with name 'BrieflyLogging', available names:
at pl.touk.nussknacker.engine.util.loader.ScalaServiceLoader$.loadNamed(ScalaServiceLoader.scala:35)
at pl.touk.nussknacker.engine.process.exception.FlinkExceptionHandler.extractBaseConsumer(FlinkExceptionHandler.scala:87)
at pl.touk.nussknacker.engine.process.exception.FlinkExceptionHandler.<init>(FlinkExceptionHandler.scala:58)
at pl.touk.nussknacker.engine.process.compiler.TestFlinkExceptionHandler.<init>(TestFlinkProcessCompilerDataFactory.scala:143)
at pl.touk.nussknacker.engine.process.compiler.TestFlinkProcessCompilerDataFactory$$anon$1.exceptionHandler(TestFlinkProcessCompilerDataFactory.scala:92)
at pl.touk.nussknacker.engine.process.compiler.FlinkProcessCompilerDataFactory.prepareCompilerData(FlinkProcessCompilerDataFactory.scala:98)
at pl.touk.nussknacker.engine.process.registrar.FlinkProcessRegistrar$.$anonfun$apply$4(FlinkProcessRegistrar.scala:439)
at pl.touk.nussknacker.engine.process.registrar.FlinkProcessRegistrar.$anonfun$register$1(FlinkProcessRegistrar.scala:81)
at pl.touk.nussknacker.engine.process.registrar.FlinkProcessRegistrar.$anonfun$register$1$adapted(FlinkProcessRegistrar.scala:78)
at pl.touk.nussknacker.engine.process.registrar.FlinkProcessRegistrar.$anonfun$usingRightClassloader$1(FlinkProcessRegistrar.scala:106)
at scala.runtime.java8.JFunction0$mcV$sp.apply(JFunction0$mcV$sp.scala:18)
at pl.touk.nussknacker.engine.util.ThreadUtils$.withThisAsContextClassLoader(ThreadUtils.scala:12)
at pl.touk.nussknacker.engine.process.registrar.FlinkProcessRegistrar.usingRightClassloader(FlinkProcessRegistrar.scala:106)
at pl.touk.nussknacker.engine.process.registrar.FlinkProcessRegistrar.register(FlinkProcessRegistrar.scala:78)
at pl.touk.nussknacker.engine.process.runner.FlinkTestMain.runTest(FlinkTestMain.scala:69)
at pl.touk.nussknacker.engine.process.runner.FlinkTestMain$.run(FlinkTestMain.scala:44)
at pl.touk.nussknacker.engine.management.testsmechanism.FlinkProcessTestRunner.runTests(FlinkProcessTestRunner.scala:37)
at pl.touk.nussknacker.engine.management.testsmechanism.FlinkProcessTestRunnerSpec.$anonfun$runTests$10(FlinkProcessTestRunnerSpec.scala:347)
at scala.concurrent.Future$.$anonfun$apply$1(Future.scala:687)
at scala.concurrent.impl.Promise$Transformation.run(Promise.scala:467)
at java.base/java.util.concurrent.ForkJoinTask$RunnableExecuteAction.exec(ForkJoinTask.java:1426)
at java.base/java.util.concurrent.ForkJoinTask.doExec(ForkJoinTask.java:290)
at java.base/java.util.concurrent.ForkJoinPool$WorkQueue.topLevelExec(ForkJoinPool.java:1020)
at java.base/java.util.concurrent.ForkJoinPool.scan(ForkJoinPool.java:1656)
at java.base/java.util.concurrent.ForkJoinPool.runWorker(ForkJoinPool.java:1594)
at java.base/java.util.concurrent.ForkJoinWorkerThread.run(ForkJoinWorkerThread.java:183)
github-actions / REPORT-BackendTests-2.13
pl.touk.nussknacker.engine.management.testsmechanism.FlinkProcessTestRunnerSpec ► A scenario run on Flink engine when IO monad interpreter is used should should throw exception when parameter was modified by AdditionalUiConfigProvider with dict editor ...
Failed test found in:
engine/flink/management/target/test-reports/TEST-pl.touk.nussknacker.engine.management.testsmechanism.FlinkProcessTestRunnerSpec.xml
engine/flink/management/target/test-reports/TEST-pl.touk.nussknacker.engine.management.testsmechanism.FlinkProcessTestRunnerSpec.xml
Error:
org.scalatest.exceptions.TestFailedException: Expected exception java.lang.IllegalStateException to be thrown, but java.lang.IllegalArgumentException was thrown
Raw output
org.scalatest.exceptions.TestFailedException: Expected exception java.lang.IllegalStateException to be thrown, but java.lang.IllegalArgumentException was thrown
at org.scalatest.Assertions.newAssertionFailedException(Assertions.scala:472)
at org.scalatest.Assertions.newAssertionFailedException$(Assertions.scala:471)
at org.scalatest.wordspec.AnyWordSpec.newAssertionFailedException(AnyWordSpec.scala:1880)
at org.scalatest.Assertions.intercept(Assertions.scala:756)
at org.scalatest.Assertions.intercept$(Assertions.scala:746)
at org.scalatest.wordspec.AnyWordSpec.intercept(AnyWordSpec.scala:1880)
at pl.touk.nussknacker.engine.management.testsmechanism.FlinkProcessTestRunnerSpec.$anonfun$runTests$35(FlinkProcessTestRunnerSpec.scala:696)
at org.scalatest.OutcomeOf.outcomeOf(OutcomeOf.scala:85)
at org.scalatest.OutcomeOf.outcomeOf$(OutcomeOf.scala:83)
at org.scalatest.OutcomeOf$.outcomeOf(OutcomeOf.scala:104)
at org.scalatest.Transformer.apply(Transformer.scala:22)
at org.scalatest.Transformer.apply(Transformer.scala:20)
at org.scalatest.wordspec.AnyWordSpecLike$$anon$3.apply(AnyWordSpecLike.scala:1240)
at org.scalatest.TestSuite.withFixture(TestSuite.scala:196)
at org.scalatest.TestSuite.withFixture$(TestSuite.scala:195)
at org.scalatest.wordspec.AnyWordSpec.withFixture(AnyWordSpec.scala:1880)
at org.scalatest.wordspec.AnyWordSpecLike.invokeWithFixture$1(AnyWordSpecLike.scala:1238)
at org.scalatest.wordspec.AnyWordSpecLike.$anonfun$runTest$1(AnyWordSpecLike.scala:1250)
at org.scalatest.SuperEngine.runTestImpl(Engine.scala:306)
at org.scalatest.wordspec.AnyWordSpecLike.runTest(AnyWordSpecLike.scala:1250)
at org.scalatest.wordspec.AnyWordSpecLike.runTest$(AnyWordSpecLike.scala:1232)
at pl.touk.nussknacker.engine.management.testsmechanism.FlinkProcessTestRunnerSpec.org$scalatest$BeforeAndAfterEach$$super$runTest(FlinkProcessTestRunnerSpec.scala:52)
at org.scalatest.BeforeAndAfterEach.runTest(BeforeAndAfterEach.scala:234)
at org.scalatest.BeforeAndAfterEach.runTest$(BeforeAndAfterEach.scala:227)
at pl.touk.nussknacker.engine.management.testsmechanism.FlinkProcessTestRunnerSpec.runTest(FlinkProcessTestRunnerSpec.scala:52)
at org.scalatest.wordspec.AnyWordSpecLike.$anonfun$runTests$1(AnyWordSpecLike.scala:1309)
at org.scalatest.SuperEngine.$anonfun$runTestsInBranch$1(Engine.scala:413)
at scala.collection.immutable.List.foreach(List.scala:334)
at org.scalatest.SuperEngine.traverseSubNodes$1(Engine.scala:401)
at org.scalatest.SuperEngine.runTestsInBranch(Engine.scala:390)
at org.scalatest.SuperEngine.$anonfun$runTestsInBranch$1(Engine.scala:427)
at scala.collection.immutable.List.foreach(List.scala:334)
at org.scalatest.SuperEngine.traverseSubNodes$1(Engine.scala:401)
at org.scalatest.SuperEngine.runTestsInBranch(Engine.scala:390)
at org.scalatest.SuperEngine.$anonfun$runTestsInBranch$1(Engine.scala:427)
at scala.collection.immutable.List.foreach(List.scala:334)
at org.scalatest.SuperEngine.traverseSubNodes$1(Engine.scala:401)
at org.scalatest.SuperEngine.runTestsInBranch(Engine.scala:396)
at org.scalatest.SuperEngine.runTestsImpl(Engine.scala:475)
at org.scalatest.wordspec.AnyWordSpecLike.runTests(AnyWordSpecLike.scala:1309)
at org.scalatest.wordspec.AnyWordSpecLike.runTests$(AnyWordSpecLike.scala:1308)
at org.scalatest.wordspec.AnyWordSpec.runTests(AnyWordSpec.scala:1880)
at org.scalatest.Suite.run(Suite.scala:1114)
at org.scalatest.Suite.run$(Suite.scala:1096)
at org.scalatest.wordspec.AnyWordSpec.org$scalatest$wordspec$AnyWordSpecLike$$super$run(AnyWordSpec.scala:1880)
at org.scalatest.wordspec.AnyWordSpecLike.$anonfun$run$1(AnyWordSpecLike.scala:1354)
at org.scalatest.SuperEngine.runImpl(Engine.scala:535)
at org.scalatest.wordspec.AnyWordSpecLike.run(AnyWordSpecLike.scala:1354)
at org.scalatest.wordspec.AnyWordSpecLike.run$(AnyWordSpecLike.scala:1352)
at org.scalatest.wordspec.AnyWordSpec.run(AnyWordSpec.scala:1880)
at org.scalatest.tools.Framework.org$scalatest$tools$Framework$$runSuite(Framework.scala:321)
at org.scalatest.tools.Framework$ScalaTestTask.execute(Framework.scala:517)
at sbt.TestRunner.runTest$1(TestFramework.scala:153)
at sbt.TestRunner.run(TestFramework.scala:168)
at sbt.TestFramework$$anon$3$$anonfun$$lessinit$greater$1.$anonfun$apply$1(TestFramework.scala:336)
at sbt.TestFramework$.sbt$TestFramework$$withContextLoader(TestFramework.scala:296)
at sbt.TestFramework$$anon$3$$anonfun$$lessinit$greater$1.apply(TestFramework.scala:336)
at sbt.TestFramework$$anon$3$$anonfun$$lessinit$greater$1.apply(TestFramework.scala:336)
at sbt.TestFunction.apply(TestFramework.scala:348)
at sbt.Tests$.processRunnable$1(Tests.scala:475)
at sbt.Tests$.$anonfun$makeSerial$1(Tests.scala:481)
at sbt.std.Transform$$anon$3.$anonfun$apply$2(Transform.scala:47)
at sbt.std.Transform$$anon$4.work(Transform.scala:69)
at sbt.Execute.$anonfun$submit$2(Execute.scala:283)
at sbt.internal.util.ErrorHandling$.wideConvert(ErrorHandling.scala:24)
at sbt.Execute.work(Execute.scala:292)
at sbt.Execute.$anonfun$submit$1(Execute.scala:283)
at sbt.ConcurrentRestrictions$$anon$4.$anonfun$submitValid$1(ConcurrentRestrictions.scala:265)
at sbt.CompletionService$$anon$2.call(CompletionService.scala:65)
at java.base/java.util.concurrent.FutureTask.run(FutureTask.java:264)
at java.base/java.util.concurrent.Executors$RunnableAdapter.call(Executors.java:515)
at java.base/java.util.concurrent.FutureTask.run(FutureTask.java:264)
at java.base/java.util.concurrent.ThreadPoolExecutor.runWorker(ThreadPoolExecutor.java:1128)
at java.base/java.util.concurrent.ThreadPoolExecutor$Worker.run(ThreadPoolExecutor.java:628)
at java.base/java.lang.Thread.run(Thread.java:829)
Caused by: java.lang.IllegalArgumentException: Failed to find pl.touk.nussknacker.engine.flink.api.exception.FlinkEspExceptionConsumerProvider with name 'BrieflyLogging', available names:
at pl.touk.nussknacker.engine.util.loader.ScalaServiceLoader$.loadNamed(ScalaServiceLoader.scala:35)
at pl.touk.nussknacker.engine.process.exception.FlinkExceptionHandler.extractBaseConsumer(FlinkExceptionHandler.scala:87)
at pl.touk.nussknacker.engine.process.exception.FlinkExceptionHandler.<init>(FlinkExceptionHandler.scala:58)
at pl.touk.nussknacker.engine.process.compiler.TestFlinkExceptionHandler.<init>(TestFlinkProcessCompilerDataFactory.scala:143)
at pl.touk.nussknacker.engine.process.compiler.TestFlinkProcessCompilerDataFactory$$anon$1.exceptionHandler(TestFlinkProcessCompilerDataFactory.scala:92)
at pl.touk.nussknacker.engine.process.compiler.FlinkProcessCompilerDataFactory.prepareCompilerData(FlinkProcessCompilerDataFactory.scala:98)
at pl.touk.nussknacker.engine.process.registrar.FlinkProcessRegistrar$.$anonfun$apply$4(FlinkProcessRegistrar.scala:439)
at pl.touk.nussknacker.engine.process.registrar.FlinkProcessRegistrar.$anonfun$register$1(FlinkProcessRegistrar.scala:81)
at pl.touk.nussknacker.engine.process.registrar.FlinkProcessRegistrar.$anonfun$register$1$adapted(FlinkProcessRegistrar.scala:78)
at pl.touk.nussknacker.engine.process.registrar.FlinkProcessRegistrar.$anonfun$usingRightClassloader$1(FlinkProcessRegistrar.scala:106)
at scala.runtime.java8.JFunction0$mcV$sp.apply(JFunction0$mcV$sp.scala:18)
at pl.touk.nussknacker.engine.util.ThreadUtils$.withThisAsContextClassLoader(ThreadUtils.scala:12)
at pl.touk.nussknacker.engine.process.registrar.FlinkProcessRegistrar.usingRightClassloader(FlinkProcessRegistrar.scala:106)
at pl.touk.nussknacker.engine.process.registrar.FlinkProcessRegistrar.register(FlinkProcessRegistrar.scala:78)
at pl.touk.nussknacker.engine.process.runner.FlinkTestMain.runTest(FlinkTestMain.scala:69)
at pl.touk.nussknacker.engine.process.runner.FlinkTestMain$.run(FlinkTestMain.scala:44)
at pl.touk.nussknacker.engine.management.testsmechanism.FlinkProcessTestRunner.runTests(FlinkProcessTestRunner.scala:37)
at pl.touk.nussknacker.engine.management.testsmechanism.FlinkProcessTestRunnerSpec.$anonfun$runTests$36(FlinkProcessTestRunnerSpec.scala:694)
at scala.concurrent.Future$.$anonfun$apply$1(Future.scala:687)
at scala.concurrent.impl.Promise$Transformation.run(Promise.scala:467)
at java.base/java.util.concurrent.ForkJoinTask$RunnableExecuteAction.exec(ForkJoinTask.java:1426)
at java.base/java.util.concurrent.ForkJoinTask.doExec(ForkJoinTask.java:290)
at java.base/java.util.concurrent.ForkJoinPool$WorkQueue.topLevelExec(ForkJoinPool.java:1020)
at java.base/java.util.concurrent.ForkJoinPool.scan(ForkJoinPool.java:1656)
at java.base/java.util.concurrent.ForkJoinPool.runWorker(ForkJoinPool.java:1594)
at java.base/java.util.concurrent.ForkJoinWorkerThread.run(ForkJoinWorkerThread.java:183)
Loading