Skip to content

Build and Unit Test #1646

Build and Unit Test

Build and Unit Test #1646

GitHub Actions / Test Report - develop failed Jan 28, 2025 in 0s

3461 tests run, 3406 passed, 53 skipped, 2 failed.

Annotations

Check failure on line 453 in cdap-build/cdap/cdap-source-control/src/test/java/io/cdap/cdap/sourcecontrol/RepositoryManagerTest.java

See this annotation in the file changed.

@github-actions github-actions / Test Report - develop

RepositoryManagerTest.testCommitAndPushNoChangeSuccess

http://localhost:34193/ignored: Read timed out after 20,000 ms
Raw output
org.eclipse.jgit.api.errors.TransportException: http://localhost:34193/ignored: Read timed out after 20,000 ms
	at org.eclipse.jgit.api.PushCommand.call(PushCommand.java:147)
	at io.cdap.cdap.sourcecontrol.RepositoryManager.commitAndPush(RepositoryManager.java:263)
	at io.cdap.cdap.sourcecontrol.RepositoryManagerTest.testCommitAndPushNoChangeSuccess(RepositoryManagerTest.java:453)
	at sun.reflect.NativeMethodAccessorImpl.invoke0(Native Method)
	at sun.reflect.NativeMethodAccessorImpl.invoke(NativeMethodAccessorImpl.java:62)
	at sun.reflect.DelegatingMethodAccessorImpl.invoke(DelegatingMethodAccessorImpl.java:43)
	at java.lang.reflect.Method.invoke(Method.java:498)
	at org.junit.runners.model.FrameworkMethod$1.runReflectiveCall(FrameworkMethod.java:47)
	at org.junit.internal.runners.model.ReflectiveCallable.run(ReflectiveCallable.java:12)
	at org.junit.runners.model.FrameworkMethod.invokeExplosively(FrameworkMethod.java:44)
	at org.junit.internal.runners.statements.InvokeMethod.evaluate(InvokeMethod.java:17)
	at org.junit.internal.runners.statements.RunBefores.evaluate(RunBefores.java:26)
	at org.junit.rules.ExternalResource$1.evaluate(ExternalResource.java:48)
	at org.junit.rules.ExternalResource$1.evaluate(ExternalResource.java:48)
	at org.junit.rules.RunRules.evaluate(RunRules.java:20)
	at org.junit.runners.ParentRunner.runLeaf(ParentRunner.java:271)
	at org.junit.runners.BlockJUnit4ClassRunner.runChild(BlockJUnit4ClassRunner.java:70)
	at org.junit.runners.BlockJUnit4ClassRunner.runChild(BlockJUnit4ClassRunner.java:50)
	at org.junit.runners.ParentRunner$3.run(ParentRunner.java:238)
	at org.junit.runners.ParentRunner$1.schedule(ParentRunner.java:63)
	at org.junit.runners.ParentRunner.runChildren(ParentRunner.java:236)
	at org.junit.runners.ParentRunner.access$000(ParentRunner.java:53)
	at org.junit.runners.ParentRunner$2.evaluate(ParentRunner.java:229)
	at org.junit.rules.ExternalResource$1.evaluate(ExternalResource.java:48)
	at org.junit.rules.RunRules.evaluate(RunRules.java:20)
	at org.junit.runners.ParentRunner.run(ParentRunner.java:309)
	at org.junit.runners.Suite.runChild(Suite.java:127)
	at org.junit.runners.Suite.runChild(Suite.java:26)
	at org.junit.runners.ParentRunner$3.run(ParentRunner.java:238)
	at org.junit.runners.ParentRunner$1.schedule(ParentRunner.java:63)
	at org.junit.runners.ParentRunner.runChildren(ParentRunner.java:236)
	at org.junit.runners.ParentRunner.access$000(ParentRunner.java:53)
	at org.junit.runners.ParentRunner$2.evaluate(ParentRunner.java:229)
	at org.junit.runners.ParentRunner.run(ParentRunner.java:309)
	at org.apache.maven.surefire.junitcore.JUnitCore.run(JUnitCore.java:55)
	at org.apache.maven.surefire.junitcore.JUnitCoreWrapper.createRequestAndRun(JUnitCoreWrapper.java:137)
	at org.apache.maven.surefire.junitcore.JUnitCoreWrapper.executeEager(JUnitCoreWrapper.java:107)
	at org.apache.maven.surefire.junitcore.JUnitCoreWrapper.execute(JUnitCoreWrapper.java:83)
	at org.apache.maven.surefire.junitcore.JUnitCoreWrapper.execute(JUnitCoreWrapper.java:75)
	at org.apache.maven.surefire.junitcore.JUnitCoreProvider.invoke(JUnitCoreProvider.java:158)
	at org.apache.maven.surefire.booter.ForkedBooter.runSuitesInProcess(ForkedBooter.java:456)
	at org.apache.maven.surefire.booter.ForkedBooter.execute(ForkedBooter.java:169)
	at org.apache.maven.surefire.booter.ForkedBooter.run(ForkedBooter.java:595)
	at org.apache.maven.surefire.booter.ForkedBooter.main(ForkedBooter.java:581)
Caused by: org.eclipse.jgit.errors.TransportException: http://localhost:34193/ignored: Read timed out after 20,000 ms
	at org.eclipse.jgit.transport.BasePackPushConnection.doPush(BasePackPushConnection.java:206)
	at org.eclipse.jgit.transport.TransportHttp$SmartHttpPushConnection.doPush(TransportHttp.java:1332)
	at org.eclipse.jgit.transport.BasePackPushConnection.push(BasePackPushConnection.java:137)
	at org.eclipse.jgit.transport.PushProcess.execute(PushProcess.java:139)
	at org.eclipse.jgit.transport.Transport.push(Transport.java:1335)
	at org.eclipse.jgit.api.PushCommand.call(PushCommand.java:137)
	... 43 more
Caused by: java.io.InterruptedIOException: Read timed out after 20,000 ms
	at org.eclipse.jgit.util.io.TimeoutInputStream.readTimedOut(TimeoutInputStream.java:120)
	at org.eclipse.jgit.util.io.TimeoutInputStream.read(TimeoutInputStream.java:92)
	at org.eclipse.jgit.util.IO.readFully(IO.java:201)
	at org.eclipse.jgit.transport.PacketLineIn.readLength(PacketLineIn.java:284)
	at org.eclipse.jgit.transport.SideBandInputStream.needDataPacket(SideBandInputStream.java:124)
	at org.eclipse.jgit.transport.SideBandInputStream.read(SideBandInputStream.java:106)
	at org.eclipse.jgit.util.IO.readFully(IO.java:201)
	at org.eclipse.jgit.transport.PacketLineIn.readLength(PacketLineIn.java:284)
	at org.eclipse.jgit.transport.PacketLineIn.readString(PacketLineIn.java:148)
	at org.eclipse.jgit.transport.BasePackPushConnection.readStringLongTimeout(BasePackPushConnection.java:404)
	at org.eclipse.jgit.transport.BasePackPushConnection.readStatusReport(BasePackPushConnection.java:337)
	at org.eclipse.jgit.transport.BasePackPushConnection.doPush(BasePackPushConnection.java:189)
	... 48 more
Caused by: java.net.SocketTimeoutException: Read timed out
	at java.net.SocketInputStream.socketRead0(Native Method)
	at java.net.SocketInputStream.socketRead(SocketInputStream.java:116)
	at java.net.SocketInputStream.read(SocketInputStream.java:171)
	at java.net.SocketInputStream.read(SocketInputStream.java:141)
	at java.io.BufferedInputStream.fill(BufferedInputStream.java:246)
	at java.io.BufferedInputStream.read1(BufferedInputStream.java:286)
	at java.io.BufferedInputStream.read(BufferedInputStream.java:345)
	at sun.net.www.http.HttpClient.parseHTTPHeader(HttpClient.java:745)
	at sun.net.www.http.HttpClient.parseHTTP(HttpClient.java:680)
	at sun.net.www.protocol.http.HttpURLConnection.getInputStream0(HttpURLConnection.java:1595)
	at sun.net.www.protocol.http.HttpURLConnection.getInputStream(HttpURLConnection.java:1500)
	at java.net.HttpURLConnection.getResponseCode(HttpURLConnection.java:480)
	at org.eclipse.jgit.transport.http.JDKHttpConnection.getResponseCode(JDKHttpConnection.java:85)
	at org.eclipse.jgit.util.HttpSupport.response(HttpSupport.java:208)
	at org.eclipse.jgit.transport.TransportHttp$Service.sendRequest(TransportHttp.java:1408)
	at org.eclipse.jgit.transport.TransportHttp$MultiRequestService.execute(TransportHttp.java:1646)
	at org.eclipse.jgit.transport.TransportHttp$Service$HttpExecuteStream.read(TransportHttp.java:1576)
	at org.eclipse.jgit.util.io.UnionInputStream.read(UnionInputStream.java:116)
	at java.io.FilterInputStream.read(FilterInputStream.java:133)
	at org.eclipse.jgit.util.io.TimeoutInputStream.read(TimeoutInputStream.java:90)
	... 58 more

Check failure on line 361 in cdap-build/cdap/cdap-source-control/src/test/java/io/cdap/cdap/sourcecontrol/operationrunner/RemoteSourceControlOperationRunnerTest.java

See this annotation in the file changed.

@github-actions github-actions / Test Report - develop

RemoteSourceControlOperationRunnerTest.testListSourceControlException

Unexpected exception, expected<io.cdap.cdap.sourcecontrol.SourceControlException> but was<org.eclipse.jgit.api.errors.TransportException>
Raw output
java.lang.Exception: Unexpected exception, expected<io.cdap.cdap.sourcecontrol.SourceControlException> but was<org.eclipse.jgit.api.errors.TransportException>
	at org.junit.internal.runners.statements.ExpectException.evaluate(ExpectException.java:28)
	at org.junit.rules.ExternalResource$1.evaluate(ExternalResource.java:48)
	at org.junit.rules.ExternalResource$1.evaluate(ExternalResource.java:48)
	at org.junit.rules.RunRules.evaluate(RunRules.java:20)
	at org.junit.runners.ParentRunner.runLeaf(ParentRunner.java:271)
	at org.junit.runners.BlockJUnit4ClassRunner.runChild(BlockJUnit4ClassRunner.java:70)
	at org.junit.runners.BlockJUnit4ClassRunner.runChild(BlockJUnit4ClassRunner.java:50)
	at org.junit.runners.ParentRunner$3.run(ParentRunner.java:238)
	at org.junit.runners.ParentRunner$1.schedule(ParentRunner.java:63)
	at org.junit.runners.ParentRunner.runChildren(ParentRunner.java:236)
	at org.junit.runners.ParentRunner.access$000(ParentRunner.java:53)
	at org.junit.runners.ParentRunner$2.evaluate(ParentRunner.java:229)
	at org.junit.internal.runners.statements.RunBefores.evaluate(RunBefores.java:26)
	at org.junit.internal.runners.statements.RunAfters.evaluate(RunAfters.java:27)
	at org.junit.rules.ExternalResource$1.evaluate(ExternalResource.java:48)
	at org.junit.rules.ExternalResource$1.evaluate(ExternalResource.java:48)
	at org.junit.rules.RunRules.evaluate(RunRules.java:20)
	at org.junit.runners.ParentRunner.run(ParentRunner.java:309)
	at org.junit.runners.Suite.runChild(Suite.java:127)
	at org.junit.runners.Suite.runChild(Suite.java:26)
	at org.junit.runners.ParentRunner$3.run(ParentRunner.java:238)
	at org.junit.runners.ParentRunner$1.schedule(ParentRunner.java:63)
	at org.junit.runners.ParentRunner.runChildren(ParentRunner.java:236)
	at org.junit.runners.ParentRunner.access$000(ParentRunner.java:53)
	at org.junit.runners.ParentRunner$2.evaluate(ParentRunner.java:229)
	at org.junit.runners.ParentRunner.run(ParentRunner.java:309)
	at org.apache.maven.surefire.junitcore.JUnitCore.run(JUnitCore.java:55)
	at org.apache.maven.surefire.junitcore.JUnitCoreWrapper.createRequestAndRun(JUnitCoreWrapper.java:137)
	at org.apache.maven.surefire.junitcore.JUnitCoreWrapper.executeEager(JUnitCoreWrapper.java:107)
	at org.apache.maven.surefire.junitcore.JUnitCoreWrapper.execute(JUnitCoreWrapper.java:83)
	at org.apache.maven.surefire.junitcore.JUnitCoreWrapper.execute(JUnitCoreWrapper.java:75)
	at org.apache.maven.surefire.junitcore.JUnitCoreProvider.invoke(JUnitCoreProvider.java:158)
	at org.apache.maven.surefire.booter.ForkedBooter.runSuitesInProcess(ForkedBooter.java:456)
	at org.apache.maven.surefire.booter.ForkedBooter.execute(ForkedBooter.java:169)
	at org.apache.maven.surefire.booter.ForkedBooter.run(ForkedBooter.java:595)
	at org.apache.maven.surefire.booter.ForkedBooter.main(ForkedBooter.java:581)
Caused by: org.eclipse.jgit.api.errors.TransportException: http://localhost:39983/ignored: Read timed out after 20,000 ms
	at org.eclipse.jgit.api.PushCommand.call(PushCommand.java:147)
	at io.cdap.cdap.sourcecontrol.SourceControlTestBase.addFileToGit(SourceControlTestBase.java:137)
	at io.cdap.cdap.sourcecontrol.operationrunner.RemoteSourceControlOperationRunnerTest.testListSourceControlException(RemoteSourceControlOperationRunnerTest.java:361)
	at sun.reflect.NativeMethodAccessorImpl.invoke0(Native Method)
	at sun.reflect.NativeMethodAccessorImpl.invoke(NativeMethodAccessorImpl.java:62)
	at sun.reflect.DelegatingMethodAccessorImpl.invoke(DelegatingMethodAccessorImpl.java:43)
	at java.lang.reflect.Method.invoke(Method.java:498)
	at org.junit.runners.model.FrameworkMethod$1.runReflectiveCall(FrameworkMethod.java:47)
	at org.junit.internal.runners.model.ReflectiveCallable.run(ReflectiveCallable.java:12)
	at org.junit.runners.model.FrameworkMethod.invokeExplosively(FrameworkMethod.java:44)
	at org.junit.internal.runners.statements.InvokeMethod.evaluate(InvokeMethod.java:17)
	at org.junit.internal.runners.statements.ExpectException.evaluate(ExpectException.java:19)
	... 35 more
Caused by: org.eclipse.jgit.errors.TransportException: http://localhost:39983/ignored: Read timed out after 20,000 ms
	at org.eclipse.jgit.transport.BasePackPushConnection.doPush(BasePackPushConnection.java:206)
	at org.eclipse.jgit.transport.TransportHttp$SmartHttpPushConnection.doPush(TransportHttp.java:1332)
	at org.eclipse.jgit.transport.BasePackPushConnection.push(BasePackPushConnection.java:137)
	at org.eclipse.jgit.transport.PushProcess.execute(PushProcess.java:139)
	at org.eclipse.jgit.transport.Transport.push(Transport.java:1335)
	at org.eclipse.jgit.api.PushCommand.call(PushCommand.java:137)
	... 46 more
Caused by: java.io.InterruptedIOException: Read timed out after 20,000 ms
	at org.eclipse.jgit.util.io.TimeoutInputStream.readTimedOut(TimeoutInputStream.java:120)
	at org.eclipse.jgit.util.io.TimeoutInputStream.read(TimeoutInputStream.java:92)
	at org.eclipse.jgit.util.IO.readFully(IO.java:201)
	at org.eclipse.jgit.transport.PacketLineIn.readLength(PacketLineIn.java:284)
	at org.eclipse.jgit.transport.SideBandInputStream.needDataPacket(SideBandInputStream.java:124)
	at org.eclipse.jgit.transport.SideBandInputStream.read(SideBandInputStream.java:106)
	at org.eclipse.jgit.util.IO.readFully(IO.java:201)
	at org.eclipse.jgit.transport.PacketLineIn.readLength(PacketLineIn.java:284)
	at org.eclipse.jgit.transport.PacketLineIn.readString(PacketLineIn.java:148)
	at org.eclipse.jgit.transport.BasePackPushConnection.readStringLongTimeout(BasePackPushConnection.java:404)
	at org.eclipse.jgit.transport.BasePackPushConnection.readStatusReport(BasePackPushConnection.java:337)
	at org.eclipse.jgit.transport.BasePackPushConnection.doPush(BasePackPushConnection.java:189)
	... 51 more
Caused by: java.net.SocketTimeoutException: Read timed out
	at java.net.SocketInputStream.socketRead0(Native Method)
	at java.net.SocketInputStream.socketRead(SocketInputStream.java:116)
	at java.net.SocketInputStream.read(SocketInputStream.java:171)
	at java.net.SocketInputStream.read(SocketInputStream.java:141)
	at java.io.BufferedInputStream.fill(BufferedInputStream.java:246)
	at java.io.BufferedInputStream.read1(BufferedInputStream.java:286)
	at java.io.BufferedInputStream.read(BufferedInputStream.java:345)
	at sun.net.www.http.HttpClient.parseHTTPHeader(HttpClient.java:745)
	at sun.net.www.http.HttpClient.parseHTTP(HttpClient.java:680)
	at sun.net.www.protocol.http.HttpURLConnection.getInputStream0(HttpURLConnection.java:1595)
	at sun.net.www.protocol.http.HttpURLConnection.getInputStream(HttpURLConnection.java:1500)
	at java.net.HttpURLConnection.getResponseCode(HttpURLConnection.java:480)
	at org.eclipse.jgit.transport.http.JDKHttpConnection.getResponseCode(JDKHttpConnection.java:85)
	at org.eclipse.jgit.util.HttpSupport.response(HttpSupport.java:208)
	at org.eclipse.jgit.transport.TransportHttp$Service.sendRequest(TransportHttp.java:1408)
	at org.eclipse.jgit.transport.TransportHttp$MultiRequestService.execute(TransportHttp.java:1646)
	at org.eclipse.jgit.transport.TransportHttp$Service$HttpExecuteStream.read(TransportHttp.java:1576)
	at org.eclipse.jgit.util.io.UnionInputStream.read(UnionInputStream.java:116)
	at java.io.FilterInputStream.read(FilterInputStream.java:133)
	at org.eclipse.jgit.util.io.TimeoutInputStream.read(TimeoutInputStream.java:90)
	... 61 more